Reaction Details
TargetMitogen-activated protein kinase 14
LigandBDBM50356006
Substrate/Competitorn/a
Meas. Tech.ChEMBL_774897 (CHEMBL1913342)
IC50 5±n/a nM
Citation Eastwood, PGonzález, JGómez, ECaturla, FAguilar, NMir, MAiguadé, JMatassa, VBalagué, COrellana, ADomínguez, M Indolin-2-one p38a inhibitors III: bioisosteric amide replacement. Bioorg Med Chem Lett21:6253-7 (2011) 
 
Mitogen-activated protein kinase 14
Name:Mitogen-activated protein kinase 14
Type:Serine/threonine-protein kinase
Mol. Mass.:41286.76
Organism:Homo sapiens (Human)
Description:Q16539
Residue:360
BDBM50356006
NameBDBM50356006
Synonyms:CHEMBL1911341
TypeSmall organic molecule
Emp. Form.C20H19N3O3
Mol. Mass.349.3832
SMILESCc1ccc2c(N)noc2c1-c1ccc2c(NC(=O)C22CCOCC2)c1