Reaction Details
TargetCannabinoid receptor 1
LigandBDBM50356013
Substrate/Competitorn/a
Meas. Tech.ChEMBL_775350 (CHEMBL1912835)
Kd 12.4±n/a nM
Citation Yang, YMiller, KJZhu, YHong, YTian, YMurugesan, NGu, ZO'Tanyi, EKeim, WJRohrbach, KWJohnghar, SBehnia, KPelleymounter, MACarlson, KEEwing, WR Characterization of a novel and selective CB1 antagonist as a radioligand for receptor occupancy studies. Bioorg Med Chem Lett21:6856-60 (2011) 
 
Cannabinoid receptor 1
Name:Cannabinoid receptor 1
Type:G Protein-Coupled Receptor (GPCR)
Mol. Mass.:52856.55
Organism:Rattus norvegicus (rat)
Description:P20272
Residue:473
BDBM50356013
NameBDBM50356013
Synonyms:CHEMBL1911374 | CHEMBL1911375
TypeSmall organic molecule
Emp. Form.C23H14ClF3N6O
Mol. Mass.482.845
SMILESFC(F)(F)c1ccc(Cn2nc3c(-c4ccncc4)c(cnn3c2=O)-c2ccc(Cl)cc2)cn1