Reaction Details
Target5-hydroxytryptamine receptor 1B
LigandBDBM50027065
Substrate/Competitorn/a
Meas. Tech.ChEMBL_774993 (CHEMBL1912148)
Ki 2.1±n/a nM
Citation Ghoneim, OMIbrahim, DAEl-Deeb, IMLee, SHBooth, RG A novel potential therapeutic avenue for autism: design, synthesis and pharmacophore generation of SSRIs with dual action. Bioorg Med Chem Lett21:6714-23 (2011) 
 
5-hydroxytryptamine receptor 1B
Name:5-hydroxytryptamine receptor 1B
Type:G Protein-Coupled Receptor (GPCR)
Mol. Mass.:43579.17
Organism:Homo sapiens (Human)
Description:Receptor binding assays were performed using human clone stably expressed in CHO cells
Residue:390
BDBM50027065
NameBDBM50027065
Synonyms:(5'alpha)-12'-hydroxy-2'-methyl-5'-(phenylmethyl)ergotoman-3',6',18-trione 12'-hydroxy-2'-methyl-5'alpha-(phenylmethyl)ergotaman-3',6',18-trione Ergotamin
TypeSmall organic molecule
Emp. Form.C33H35N5O5
Mol. Mass.581.6615
SMILESCN1C[C@@H](C=C2[C@H]1Cc1c[nH]c3cccc2c13)C(=O)N[C@]1(C)O[C@@]2(O)[C@@H]3CCCN3C(=O)[C@H](Cc3ccccc3)N2C1=O