Reaction Details
TargetCalcitonin gene-related peptide 1
LigandBDBM50356296
Substrate/Competitorn/a
Meas. Tech.ChEMBL_775006 (CHEMBL1912161)
Ki 1800±n/a nM
Citation Zartman, CBBell, IMGallicchio, SNGraham, SLKane, SAMallee, JJRutledge, RZSalvatore, CAVacca, JPWilliams, TM Identification of a novel RAMP-independent CGRP receptor antagonist. Bioorg Med Chem Lett21:6705-8 (2011) 
 
Calcitonin gene-related peptide 1
Name:Calcitonin gene-related peptide 1
Type:Enzyme
Mol. Mass.:13902.80
Organism:Homo sapiens (Human)
Description:P06881
Residue:128
BDBM50356296
NameBDBM50356296
Synonyms:CHEMBL1910951
TypeSmall organic molecule
Emp. Form.C16H21BrN4O5S
Mol. Mass.461.331
SMILESOc1c(Br)cc(nc1C(=O)NCC(=O)NC1CCC1)N1CCCCS1(=O)=O