Reaction Details
TargetCalcitonin gene-related peptide 1
LigandBDBM50356279
Substrate/Competitorn/a
Meas. Tech.ChEMBL_775098 (CHEMBL1912357)
Ki 8±n/a nM
Citation Zartman, CBBell, IMGallicchio, SNGraham, SLKane, SAMallee, JJRutledge, RZSalvatore, CAVacca, JPWilliams, TM Identification of a novel RAMP-independent CGRP receptor antagonist. Bioorg Med Chem Lett21:6705-8 (2011) 
 
Calcitonin gene-related peptide 1
Name:Calcitonin gene-related peptide 1
Type:Enzyme
Mol. Mass.:13902.80
Organism:Homo sapiens (Human)
Description:P06881
Residue:128
BDBM50356279
NameBDBM50356279
Synonyms:CHEMBL1910937
TypeSmall organic molecule
Emp. Form.C25H29Br2N5O4
Mol. Mass.623.337
SMILESCN(C)C(=O)[C@@H](Cc1cc(Br)c(O)c(Br)c1)NC(=O)N1CCC(CC1)N1Cc2ccccc2NC1=O