Reaction Details
TargetCalcitonin gene-related peptide 1
LigandBDBM50356285
Substrate/Competitorn/a
Meas. Tech.ChEMBL_775008 (CHEMBL1912163)
IC50>10000±n/a nM
Citation Zartman, CBBell, IMGallicchio, SNGraham, SLKane, SAMallee, JJRutledge, RZSalvatore, CAVacca, JPWilliams, TM Identification of a novel RAMP-independent CGRP receptor antagonist. Bioorg Med Chem Lett21:6705-8 (2011) 
 
Calcitonin gene-related peptide 1
Name:Calcitonin gene-related peptide 1
Type:Enzyme
Mol. Mass.:13902.80
Organism:Homo sapiens (Human)
Description:P06881
Residue:128
BDBM50356285
NameBDBM50356285
Synonyms:CHEMBL1910939
TypeSmall organic molecule
Emp. Form.C19H24N4O6S
Mol. Mass.436.482
SMILESCC(C)(C)OC(=O)CNC(=O)c1nc(N2CCCCS2(=O)=O)c2cccnc2c1O