Reaction Details
TargetCalcitonin gene-related peptide 1
LigandBDBM50356289
Substrate/Competitorn/a
Meas. Tech.ChEMBL_775006 (CHEMBL1912161)
Ki 26000±n/a nM
Citation Zartman, CBBell, IMGallicchio, SNGraham, SLKane, SAMallee, JJRutledge, RZSalvatore, CAVacca, JPWilliams, TM Identification of a novel RAMP-independent CGRP receptor antagonist. Bioorg Med Chem Lett21:6705-8 (2011) 
 
Calcitonin gene-related peptide 1
Name:Calcitonin gene-related peptide 1
Type:Enzyme
Mol. Mass.:13902.80
Organism:Homo sapiens (Human)
Description:P06881
Residue:128
BDBM50356289
NameBDBM50356289
Synonyms:CHEMBL1910943
TypeSmall organic molecule
Emp. Form.C21H20FN3O4S
Mol. Mass.429.465
SMILESOc1c(nc(N2CCCCS2(=O)=O)c2ccccc12)C(=O)NCc1cccc(F)c1