Reaction Details
TargetCalcitonin gene-related peptide 1
LigandBDBM50356292
Substrate/Competitorn/a
Meas. Tech.ChEMBL_775006 (CHEMBL1912161)
Ki 45000±n/a nM
Citation Zartman, CBBell, IMGallicchio, SNGraham, SLKane, SAMallee, JJRutledge, RZSalvatore, CAVacca, JPWilliams, TM Identification of a novel RAMP-independent CGRP receptor antagonist. Bioorg Med Chem Lett21:6705-8 (2011) 
 
Calcitonin gene-related peptide 1
Name:Calcitonin gene-related peptide 1
Type:Enzyme
Mol. Mass.:13902.80
Organism:Homo sapiens (Human)
Description:P06881
Residue:128
BDBM50356292
NameBDBM50356292
Synonyms:CHEMBL1910946
TypeSmall organic molecule
Emp. Form.C17H17F2N3O4S
Mol. Mass.397.396
SMILESOc1ccc(nc1C(=O)NCc1cc(F)cc(F)c1)N1CCCCS1(=O)=O