Reaction Details
TargetSodium-dependent dopamine transporter
LigandBDBM50356626
Substrate/Competitorn/a
Meas. Tech.ChEMBL_785530 (CHEMBL1920093)
Ki 4.1±n/a nM
Citation Liu, JZhu, LPlössl, KLieberman, BPKung, HF Synthesis and evaluation of novel N-fluoropyridyl derivatives of tropane as potential PET imaging agents for the dopamine transporter. Bioorg Med Chem Lett21:2962-5 (2011) 
 
Sodium-dependent dopamine transporter
Name:Sodium-dependent dopamine transporter
Type:Multi-pass membrane protein
Mol. Mass.:68497.11
Organism:Homo sapiens (Human)
Description:Q01959
Residue:620
BDBM50356626
NameBDBM50356626
Synonyms:CHEMBL1914699
TypeSmall organic molecule
Emp. Form.C20H23ClFN3
Mol. Mass.359.868
SMILESCN1C2CCC1[C@@H](CNc1cccc(F)n1)[C@H](C2)c1ccc(Cl)cc1