Reaction Details
TargetSigma non-opioid intracellular receptor 1
LigandBDBM50334158
Substrate/Competitorn/a
Meas. Tech.ChEMBL_787915 (CHEMBL1918797)
Ki 0.59±n/a nM
Citation Moussa, IABanister, SDGiboureau, NMeikle, SRKassiou, M Synthesis and in vivo evaluation of [18F]N-(2-benzofuranylmethyl)-N'-[4-(2-fluoroethoxy)benzyl]piperazine, a novels1 receptor PET imaging agent. Bioorg Med Chem Lett21:6820-3 (2011) 
 
Sigma non-opioid intracellular receptor 1
Name:Sigma non-opioid intracellular receptor 1
Type:Enzyme Catalytic Domain
Mol. Mass.:25124.85
Organism:Homo sapiens (Human)
Description:Q99720
Residue:223
BDBM50334158
NameBDBM50334158
Synonyms:1'-benzyl-3-(2-fluoroethyl)-3H-spiro[[2]benzofuran-1,4'-piperidine CHEMBL2314421
TypeSmall organic molecule
Emp. Form.C21H24FNO
Mol. Mass.325.4198
SMILESFCCC1OC2(CCN(Cc3ccccc3)CC2)c2ccccc12