Reaction Details
TargetSerine/threonine-protein kinase mTOR
LigandBDBM50357653
Substrate/Competitorn/a
Meas. Tech.ChEMBL_786054 (CHEMBL1919685)
IC50 0.410000±n/a nM
Citation Nishimura, NSiegmund, ALiu, LYang, KBryan, MCAndrews, KLBo, YBooker, SKCaenepeel, SFreeman, DLiao, HMcCarter, JMullady, ELSan Miguel, TSubramanian, RTamayo, NWang, LWhittington, DAZalameda, LZhang, NHughes, PENorman, MH Phospshoinositide 3-kinase (PI3K)/mammalian target of rapamycin (mTOR) dual inhibitors: discovery and structure-activity relationships of a series of quinoline and quinoxaline derivatives. J Med Chem54:4735-51 (2011) 
 
Serine/threonine-protein kinase mTOR
Name:Serine/threonine-protein kinase mTOR
Type:Rapamycin target protein
Mol. Mass.:288917.12
Organism:Homo sapiens (Human)
Description:P42345
Residue:2549
BDBM50357653
NameBDBM50357653
Synonyms:CHEMBL1914727
TypeSmall organic molecule
Emp. Form.C25H16ClFN4O2S
Mol. Mass.490.937
SMILESFc1ccc(cc1)S(=O)(=O)Nc1cc(cnc1Cl)-c1ccc2nccc(-c3ccncc3)c2c1