Reaction Details
TargetSerine/threonine-protein kinase mTOR
LigandBDBM50357651
Substrate/Competitorn/a
Meas. Tech.ChEMBL_786054 (CHEMBL1919685)
IC50 3.9±n/a nM
Citation Nishimura, NSiegmund, ALiu, LYang, KBryan, MCAndrews, KLBo, YBooker, SKCaenepeel, SFreeman, DLiao, HMcCarter, JMullady, ELSan Miguel, TSubramanian, RTamayo, NWang, LWhittington, DAZalameda, LZhang, NHughes, PENorman, MH Phospshoinositide 3-kinase (PI3K)/mammalian target of rapamycin (mTOR) dual inhibitors: discovery and structure-activity relationships of a series of quinoline and quinoxaline derivatives. J Med Chem54:4735-51 (2011) 
 
Serine/threonine-protein kinase mTOR
Name:Serine/threonine-protein kinase mTOR
Type:Rapamycin target protein
Mol. Mass.:288917.12
Organism:Homo sapiens (Human)
Description:P42345
Residue:2549
BDBM50357651
NameBDBM50357651
Synonyms:CHEMBL1914724
TypeSmall organic molecule
Emp. Form.C30H26ClFN6O2S
Mol. Mass.589.083
SMILESFc1ccc(cc1)S(=O)(=O)Nc1cc(cnc1Cl)-c1ccc2nccc(N3CCN(Cc4ccncc4)CC3)c2c1