Reaction Details
TargetLaccase
LigandBDBM50357700
Substrate/Competitorn/a
Meas. Tech.ChEMBL_786154 (CHEMBL1919988)
IC50 4700±n/a nM
Citation Dalisay, DSSaludes, JPMolinski, TF Ptilomycalin A inhibits laccase and melanization in Cryptococcus neoformans. Bioorg Med Chem19:6654-7 (2011) 
 
Laccase
Name:Laccase
Synonyms:n/a
Type:PROTEIN
Mol. Mass.:55472.53
Organism:Trametes versicolor
Description:ChEMBL_786157
Residue:520
BDBM50357700
NameBDBM50357700
Synonyms:PTILOMYCALIN A
TypeSmall organic molecule
Emp. Form.C45H83N6O5
Mol. Mass.788.1772
SMILESCC[C@H]1CCCC[C@@]2(C[C@@H]3CC[C@@H]4[C@H](C(=O)OCCCCCCCCCCCCCCCC(=O)N(CCCN)CCCCN)[C@]5(CCC[C@@H](C)O5)NC(N2)=[N+]34)O1