Reaction Details
TargetBcl-2-like protein 2
LigandBDBM50357753
Substrate/Competitorn/a
Meas. Tech.ChEMBL_785938 (CHEMBL1921248)
Ki 55±n/a nM
Citation Goreshnik, IBrock, AMMaly, DJ Biochemical and pharmacological profiling of the pro-survival protein Bcl-xL. Bioorg Med Chem Lett21:4951-5 (2011) 
 
Bcl-2-like protein 2
Name:Bcl-2-like protein 2
Type:Protein
Mol. Mass.:20742.61
Organism:Homo sapiens (Human)
Description:n/a
Residue:193
BDBM50357753
NameBDBM50357753
Synonyms:CHEMBL1916191
TypeSmall organic molecule
Emp. Form.C38H43F3N6O5S2
Mol. Mass.784.91
SMILESC[C@@H]1CN(CCN1Cc1ccccc1C(F)(F)F)c1ccc(cc1)C(=O)NS(=O)(=O)c1ccc(N[C@H](CCN(C)C)CSc2ccccc2)c(c1)[N+]([O-])=O