Reaction Details
TargetInduced myeloid leukemia cell differentiation protein Mcl-1 homolog
LigandBDBM50357754
Substrate/Competitorn/a
Meas. Tech.ChEMBL_785939 (CHEMBL1921249)
Ki>10000±n/a nM
Citation Goreshnik, IBrock, AMMaly, DJ Biochemical and pharmacological profiling of the pro-survival protein Bcl-xL. Bioorg Med Chem Lett21:4951-5 (2011) 
 
Induced myeloid leukemia cell differentiation protein Mcl-1 homolog
Name:Induced myeloid leukemia cell differentiation protein Mcl-1 homolog
Type:Developmental protein
Mol. Mass.:35215.08
Organism:Mus musculus (Mouse)
Description:n/a
Residue:331
BDBM50357754
NameBDBM50357754
Synonyms:CHEMBL1916192
TypeSmall organic molecule
Emp. Form.C39H45F3N6O5S2
Mol. Mass.798.937
SMILESCC1CN(CC(C)N1Cc1ccccc1C(F)(F)F)c1ccc(cc1)C(=O)NS(=O)(=O)c1ccc(N[C@H](CCN(C)C)CSc2ccccc2)c(c1)[N+]([O-])=O