Reaction Details
Target1-phosphatidylinositol 4,5-bisphosphate phosphodiesterase delta-1
LigandBDBM50357882
Substrate/Competitorn/a
Meas. Tech.ChEMBL_787631 (CHEMBL1918084)
Kd 2200±n/a nM
Citation Anraku, KInoue, TSugimoto, KKudo, KOkamoto, YMorii, TMori, YOtsuka, M Design and synthesis of biotinylated inositol 1,3,4,5-tetrakisphosphate targeting Grp1 pleckstrin homology domain. Bioorg Med Chem19:6833-41 (2011) 
 
1-phosphatidylinositol 4,5-bisphosphate phosphodiesterase delta-1
Name:1-phosphatidylinositol 4,5-bisphosphate phosphodiesterase delta-1
Type:PROTEIN
Mol. Mass.:85958.21
Organism:Rattus norvegicus
Description:ChEMBL_787631
Residue:756
BDBM50357882
NameBDBM50357882
Synonyms:CHEMBL1916341
TypeSmall organic molecule
Emp. Form.C22H42N3O17P3S
Mol. Mass.745.565
SMILESO[C@@H]1[C@H](O)[C@@H](OP(O)(O)=O)[C@H](OP(O)(O)=O)[C@@H](O)[C@@H]1OP(O)(=O)OCCCCCCNC(=O)CCCC[C@@H]1SC[C@@H]2NC(=O)N[C@H]12