Reaction Details
TargetCytohesin-3
LigandBDBM50075651
Substrate/Competitorn/a
Meas. Tech.ChEMBL_787633 (CHEMBL1918086)
Kd 100±n/a nM
Citation Anraku, KInoue, TSugimoto, KKudo, KOkamoto, YMorii, TMori, YOtsuka, M Design and synthesis of biotinylated inositol 1,3,4,5-tetrakisphosphate targeting Grp1 pleckstrin homology domain. Bioorg Med Chem19:6833-41 (2011) 
 
Cytohesin-3
Name:Cytohesin-3
Type:PROTEIN
Mol. Mass.:46329.05
Organism:Rattus norvegicus
Description:ChEMBL_787633
Residue:400
BDBM50075651
NameBDBM50075651
Synonyms:1D-myo-inositol 1,3,4,5-tetrakis(dihydrogen phosphate) CHEMBL23552
TypeSmall organic molecule
Emp. Form.C6H16O18P4
Mol. Mass.500.0755
SMILESO[C@H]1[C@@H](OP(O)(O)=O)[C@H](O)[C@@H](OP(O)(O)=O)[C@H](OP(O)(O)=O)[C@H]1OP(O)(O)=O