Reaction Details
TargetNeuronal acetylcholine receptor subunit alpha-7
LigandBDBM50358023
Substrate/Competitorn/a
Meas. Tech.ChEMBL_786495 (CHEMBL1921076)
Ki 91.40±n/a nM
Citation Dallanoce, CFrigerio, FGrazioso, GMatera, CVisconti, GLDe Amici, MPucci, LPistillo, FFucile, SGotti, CClementi, FDe Micheli, C New spirocyclic¿²-isoxazoline derivatives related to selective agonists ofa7 neuronal nicotinic acetylcholine receptors. Eur J Med Chem46:5790-9 (2011) 
 
Neuronal acetylcholine receptor subunit alpha-7
Name:Neuronal acetylcholine receptor subunit alpha-7
Type:Enzyme
Mol. Mass.:56502.44
Organism:Rattus norvegicus (Rat)
Description:Q05941
Residue:502
BDBM50358023
NameBDBM50358023
Synonyms:CHEMBL1917550
TypeSmall organic molecule
Emp. Form.C11H19N2O2
Mol. Mass.211.2802
SMILESCOC1=NOC2(C1)C[N+]1(C)CCC2CC1