Reaction Details
TargetRAF proto-oncogene serine/threonine-protein kinase
LigandBDBM50358043
Substrate/Competitorn/a
Meas. Tech.ChEMBL_786851 (CHEMBL1919769)
IC50 4.9±n/a nM
Citation Kim, HKim, MLee, JYu, HHah, JM Syntheses of phenylpyrazolodiazepin-7-ones as conformationally rigid analogs of aminopyrazole amide scaffold and their antiproliferative effects on cancer cells. Bioorg Med Chem19:6760-7 (2011) 
 
RAF proto-oncogene serine/threonine-protein kinase
Name:RAF proto-oncogene serine/threonine-protein kinase
Type:Serine/threonine-protein kinase
Mol. Mass.:73082.52
Organism:Homo sapiens (Human)
Description:P04049
Residue:648
BDBM50358043
NameBDBM50358043
Synonyms:CHEMBL1794051 | GW-5074
TypeSmall organic molecule
Emp. Form.C15H10Br2INO2
Mol. Mass.522.958
SMILESOC1Nc2ccc(I)cc2C1=Cc1cc(Br)c(O)c(Br)c1