Reaction Details
TargetAcetylcholinesterase
LigandBDBM50358073
Substrate/Competitorn/a
Meas. Tech.ChEMBL_787039 (CHEMBL1918529)
IC50 688±n/a nM
Citation Shan, WJHuang, LZhou, QMeng, FCLi, XS Synthesis, biological evaluation of 9-N-substituted berberine derivatives as multi-functional agents of antioxidant, inhibitors of acetylcholinesterase, butyrylcholinesterase and amyloid-ß aggregation. Eur J Med Chem46:5885-93 (2011) 
 
Acetylcholinesterase
Name:Acetylcholinesterase
Type:Enzyme
Mol. Mass.:71812.79
Organism:Electrophorus electricus (Electric eel)
Description:n/a
Residue:633
BDBM50358073
NameBDBM50358073
Synonyms:CHEMBL1915190
TypeSmall organic molecule
Emp. Form.C27H25N2O4
Mol. Mass.441.4979
SMILESCOc1ccc2cc3-c4cc5OCOc5cc4CCn3cc2\c1=[NH+]\CCOc1ccccc1