Reaction Details
TargetAcetylcholinesterase
LigandBDBM50358087
Substrate/Competitorn/a
Meas. Tech.ChEMBL_787039 (CHEMBL1918529)
IC50 238±n/a nM
Citation Shan, WJHuang, LZhou, QMeng, FCLi, XS Synthesis, biological evaluation of 9-N-substituted berberine derivatives as multi-functional agents of antioxidant, inhibitors of acetylcholinesterase, butyrylcholinesterase and amyloid-ß aggregation. Eur J Med Chem46:5885-93 (2011) 
 
Acetylcholinesterase
Name:Acetylcholinesterase
Type:Enzyme
Mol. Mass.:71812.79
Organism:Electrophorus electricus (Electric eel)
Description:n/a
Residue:633
BDBM50358087
NameBDBM50358087
Synonyms:CHEMBL1915201
TypeSmall organic molecule
Emp. Form.C27H24FN2O3
Mol. Mass.443.4889
SMILESCOc1ccc2cc3-c4cc5OCOc5cc4CCn3cc2\c1=[NH+]\CCc1ccc(F)cc1