Reaction Details
TargetCholinesterase
LigandBDBM50358074
Substrate/Competitorn/a
Meas. Tech.ChEMBL_787037 (CHEMBL1918527)
IC50 216±n/a nM
Citation Shan, WJHuang, LZhou, QMeng, FCLi, XS Synthesis, biological evaluation of 9-N-substituted berberine derivatives as multi-functional agents of antioxidant, inhibitors of acetylcholinesterase, butyrylcholinesterase and amyloid-ß aggregation. Eur J Med Chem46:5885-93 (2011) 
 
Cholinesterase
Name:Cholinesterase
Type:Enzyme
Mol. Mass.:65643.35
Organism:Equus caballus (Horse)
Description:P81908
Residue:574
BDBM50358074
NameBDBM50358074
Synonyms:CHEMBL1915191
TypeSmall organic molecule
Emp. Form.C28H27N2O4
Mol. Mass.455.5244
SMILESCOc1ccc2cc3-c4cc5OCOc5cc4CCn3cc2\c1=[NH+]\CCCOc1ccccc1