Reaction Details
TargetCholinesterase
LigandBDBM50358093
Substrate/Competitorn/a
Meas. Tech.ChEMBL_787037 (CHEMBL1918527)
IC50 424±n/a nM
Citation Shan, WJHuang, LZhou, QMeng, FCLi, XS Synthesis, biological evaluation of 9-N-substituted berberine derivatives as multi-functional agents of antioxidant, inhibitors of acetylcholinesterase, butyrylcholinesterase and amyloid-ß aggregation. Eur J Med Chem46:5885-93 (2011) 
 
Cholinesterase
Name:Cholinesterase
Type:Enzyme
Mol. Mass.:65643.35
Organism:Equus caballus (Horse)
Description:P81908
Residue:574
BDBM50358093
NameBDBM50358093
Synonyms:CHEMBL1915207
TypeSmall organic molecule
Emp. Form.C27H23Cl2N2O3
Mol. Mass.494.389
SMILESCOc1ccc2cc3-c4cc5OCOc5cc4CCn3cc2\c1=[NH+]\CCc1ccc(Cl)cc1Cl