Reaction Details
TargetRAC-alpha serine/threonine-protein kinase
LigandBDBM50358247
Substrate/Competitorn/a
Meas. Tech.ChEMBL_790766 (CHEMBL1926219)
IC50>100000±n/a nM
Citation Lai, DYu, Svan Ofwegen, LTotzke, FProksch, PLin, W 9,10-secosteroids, protein kinase inhibitors from the Chinese gorgonian Astrogorgia sp. Bioorg Med Chem19:6873-80 (2011) 
 
RAC-alpha serine/threonine-protein kinase
Name:RAC-alpha serine/threonine-protein kinase
Type:Enzyme
Mol. Mass.:55681.25
Organism:Homo sapiens (Human)
Description:P31749
Residue:480
BDBM50358247
NameBDBM50358247
Synonyms:ASTROGORGIADIOL
TypeSmall organic molecule
Emp. Form.C27H44O2
Mol. Mass.400.6371
SMILESCC(C)CCC[C@@H](C)[C@H]1CC[C@H]2[C@H](CCc3cc(O)ccc3C)[C@H](O)CC[C@]12C