Reaction Details
TargetRAC-alpha serine/threonine-protein kinase
LigandBDBM50358249
Substrate/Competitorn/a
Meas. Tech.ChEMBL_790766 (CHEMBL1926219)
IC50>100000±n/a nM
Citation Lai, DYu, Svan Ofwegen, LTotzke, FProksch, PLin, W 9,10-secosteroids, protein kinase inhibitors from the Chinese gorgonian Astrogorgia sp. Bioorg Med Chem19:6873-80 (2011) 
 
RAC-alpha serine/threonine-protein kinase
Name:RAC-alpha serine/threonine-protein kinase
Type:Enzyme
Mol. Mass.:55681.25
Organism:Homo sapiens (Human)
Description:P31749
Residue:480
BDBM50358249
NameBDBM50358249
Synonyms:CHEMBL515982
TypeSmall organic molecule
Emp. Form.C28H44O2
Mol. Mass.412.6478
SMILESCC(C)C(=C)CC[C@@H](C)[C@H]1CC[C@H]2[C@H](CCc3cc(O)ccc3C)[C@H](O)CC[C@]12C