Reaction Details
TargetALK tyrosine kinase receptor
LigandBDBM50358243
Substrate/Competitorn/a
Meas. Tech.ChEMBL_790767 (CHEMBL1926220)
IC50 9330±n/a nM
Citation Lai, DYu, Svan Ofwegen, LTotzke, FProksch, PLin, W 9,10-secosteroids, protein kinase inhibitors from the Chinese gorgonian Astrogorgia sp. Bioorg Med Chem19:6873-80 (2011) 
 
ALK tyrosine kinase receptor
Name:ALK tyrosine kinase receptor
Type:Protein
Mol. Mass.:176453.10
Organism:Homo sapiens (Human)
Description:Q9UM73
Residue:1620
BDBM50358243
NameBDBM50358243
Synonyms:CHEMBL1922224
TypeSmall organic molecule
Emp. Form.C27H42O2
Mol. Mass.398.6212
SMILESCC(C)C\C=C\[C@@H](C)[C@H]1CC[C@H]2[C@H](CCc3cc(O)ccc3C)[C@@H](O)CC[C@]12C