Reaction Details
TargetNUAK family SNF1-like kinase 1
LigandBDBM50358244
Substrate/Competitorn/a
Meas. Tech.ChEMBL_790768 (CHEMBL1926221)
IC50>100000±n/a nM
Citation Lai, DYu, Svan Ofwegen, LTotzke, FProksch, PLin, W 9,10-secosteroids, protein kinase inhibitors from the Chinese gorgonian Astrogorgia sp. Bioorg Med Chem19:6873-80 (2011) 
 
NUAK family SNF1-like kinase 1
Name:NUAK family SNF1-like kinase 1
Type:PROTEIN
Mol. Mass.:74326.51
Organism:Homo sapiens (Human)
Description:ChEMBL_1451343
Residue:661
BDBM50358244
NameBDBM50358244
Synonyms:CALICOFEROL A
TypeSmall organic molecule
Emp. Form.C27H40O2
Mol. Mass.396.6053
SMILESCC(C)C\C=C\[C@@H](C)[C@H]1CC[C@H]2[C@H](CCc3cc(O)ccc3C)C(=O)CC[C@]12C