Reaction Details
TargetTyrosine-protein kinase receptor UFO
LigandBDBM50358245
Substrate/Competitorn/a
Meas. Tech.ChEMBL_790770 (CHEMBL1926223)
IC50 20200±n/a nM
Citation Lai, DYu, Svan Ofwegen, LTotzke, FProksch, PLin, W 9,10-secosteroids, protein kinase inhibitors from the Chinese gorgonian Astrogorgia sp. Bioorg Med Chem19:6873-80 (2011) 
 
Tyrosine-protein kinase receptor UFO
Name:Tyrosine-protein kinase receptor UFO
Type:Enzyme
Mol. Mass.:98316.97
Organism:Homo sapiens (Human)
Description:P30530
Residue:894
BDBM50358245
NameBDBM50358245
Synonyms:CHEMBL1922225
TypeSmall organic molecule
Emp. Form.C28H42O2
Mol. Mass.410.6319
SMILESCC(C)C(=C)CC[C@@H](C)[C@H]1CC[C@H]2[C@H](CCc3cc(O)ccc3C)C(=O)CC[C@]12C