Reaction Details
TargetInsulin-like growth factor 1 receptor
LigandBDBM50358246
Substrate/Competitorn/a
Meas. Tech.ChEMBL_790772 (CHEMBL1926225)
IC50 2460±n/a nM
Citation Lai, DYu, Svan Ofwegen, LTotzke, FProksch, PLin, W 9,10-secosteroids, protein kinase inhibitors from the Chinese gorgonian Astrogorgia sp. Bioorg Med Chem19:6873-80 (2011) 
 
Insulin-like growth factor 1 receptor
Name:Insulin-like growth factor 1 receptor
Type:Protein
Mol. Mass.:154776.79
Organism:Homo sapiens (Human)
Description:P08069
Residue:1367
BDBM50358246
NameBDBM50358246
Synonyms:CHEMBL456936
TypeSmall organic molecule
Emp. Form.C27H42O2
Mol. Mass.398.6212
SMILESCC(C)CCC[C@@H](C)[C@H]1CC[C@H]2[C@H](CCc3cc(O)ccc3C)C(=O)CC[C@]12C