Reaction Details
TargetHepatocyte growth factor receptor
LigandBDBM50358247
Substrate/Competitorn/a
Meas. Tech.ChEMBL_790774 (CHEMBL1926227)
IC50 78000±n/a nM
Citation Lai, DYu, Svan Ofwegen, LTotzke, FProksch, PLin, W 9,10-secosteroids, protein kinase inhibitors from the Chinese gorgonian Astrogorgia sp. Bioorg Med Chem19:6873-80 (2011) 
 
Hepatocyte growth factor receptor
Name:Hepatocyte growth factor receptor
Type:Protein
Mol. Mass.:155559.73
Organism:Homo sapiens (Human)
Description:P08581
Residue:1390
BDBM50358247
NameBDBM50358247
Synonyms:ASTROGORGIADIOL
TypeSmall organic molecule
Emp. Form.C27H44O2
Mol. Mass.400.6371
SMILESCC(C)CCC[C@@H](C)[C@H]1CC[C@H]2[C@H](CCc3cc(O)ccc3C)[C@H](O)CC[C@]12C