Reaction Details
TargetHepatocyte growth factor receptor
LigandBDBM50358248
Substrate/Competitorn/a
Meas. Tech.ChEMBL_790774 (CHEMBL1926227)
IC50>100000±n/a nM
Citation Lai, DYu, Svan Ofwegen, LTotzke, FProksch, PLin, W 9,10-secosteroids, protein kinase inhibitors from the Chinese gorgonian Astrogorgia sp. Bioorg Med Chem19:6873-80 (2011) 
 
Hepatocyte growth factor receptor
Name:Hepatocyte growth factor receptor
Type:Protein
Mol. Mass.:155559.73
Organism:Homo sapiens (Human)
Description:P08581
Residue:1390
BDBM50358248
NameBDBM50358248
Synonyms:CHEMBL456294
TypeSmall organic molecule
Emp. Form.C27H42O3
Mol. Mass.414.6206
SMILESCC(C)CCC[C@@H](C)[C@H]1[C@@H](O)C[C@H]2[C@H](CCc3cc(O)ccc3C)C(=O)CC[C@]12C