Reaction Details
TargetSerine/threonine-protein kinase Nek2
LigandBDBM50358244
Substrate/Competitorn/a
Meas. Tech.ChEMBL_790775 (CHEMBL1926228)
IC50>100000±n/a nM
Citation Lai, DYu, Svan Ofwegen, LTotzke, FProksch, PLin, W 9,10-secosteroids, protein kinase inhibitors from the Chinese gorgonian Astrogorgia sp. Bioorg Med Chem19:6873-80 (2011) 
 
Serine/threonine-protein kinase Nek2
Name:Serine/threonine-protein kinase Nek2
Type:Enzyme
Mol. Mass.:51776.96
Organism:Homo sapiens (Human)
Description:P51955
Residue:445
BDBM50358244
NameBDBM50358244
Synonyms:CALICOFEROL A
TypeSmall organic molecule
Emp. Form.C27H40O2
Mol. Mass.396.6053
SMILESCC(C)C\C=C\[C@@H](C)[C@H]1CC[C@H]2[C@H](CCc3cc(O)ccc3C)C(=O)CC[C@]12C