Reaction Details
TargetSerine/threonine-protein kinase pim-1
LigandBDBM50358250
Substrate/Competitorn/a
Meas. Tech.ChEMBL_790777 (CHEMBL1926230)
IC50>100000±n/a nM
Citation Lai, DYu, Svan Ofwegen, LTotzke, FProksch, PLin, W 9,10-secosteroids, protein kinase inhibitors from the Chinese gorgonian Astrogorgia sp. Bioorg Med Chem19:6873-80 (2011) 
 
Serine/threonine-protein kinase pim-1
Name:Serine/threonine-protein kinase pim-1
Type:Protein
Mol. Mass.:35681.82
Organism:Homo sapiens (Human)
Description:P11309
Residue:313
BDBM50358250
NameBDBM50358250
Synonyms:CALICOFEROL B
TypeSmall organic molecule
Emp. Form.C27H44O3
Mol. Mass.416.6365
SMILESCC(C)CCC[C@@H](C)[C@H]1[C@@H](O)C[C@H]2[C@H](CCc3cc(O)ccc3C)[C@H](O)CC[C@]12C