Reaction Details
TargetSerine/threonine-protein kinase PLK1
LigandBDBM50358246
Substrate/Competitorn/a
Meas. Tech.ChEMBL_790778 (CHEMBL1926231)
IC50>100000±n/a nM
Citation Lai, DYu, Svan Ofwegen, LTotzke, FProksch, PLin, W 9,10-secosteroids, protein kinase inhibitors from the Chinese gorgonian Astrogorgia sp. Bioorg Med Chem19:6873-80 (2011) 
 
Serine/threonine-protein kinase PLK1
Name:Serine/threonine-protein kinase PLK1
Type:Serine/threonine-protein kinase
Mol. Mass.:68277.16
Organism:Homo sapiens (Human)
Description:P53350
Residue:603
BDBM50358246
NameBDBM50358246
Synonyms:CHEMBL456936
TypeSmall organic molecule
Emp. Form.C27H42O2
Mol. Mass.398.6212
SMILESCC(C)CCC[C@@H](C)[C@H]1CC[C@H]2[C@H](CCc3cc(O)ccc3C)C(=O)CC[C@]12C