Reaction Details
TargetProto-oncogene tyrosine-protein kinase Src
LigandBDBM50358250
Substrate/Competitorn/a
Meas. Tech.ChEMBL_790780 (CHEMBL1926233)
IC50>100000±n/a nM
Citation Lai, DYu, Svan Ofwegen, LTotzke, FProksch, PLin, W 9,10-secosteroids, protein kinase inhibitors from the Chinese gorgonian Astrogorgia sp. Bioorg Med Chem19:6873-80 (2011) 
 
Proto-oncogene tyrosine-protein kinase Src
Name:Proto-oncogene tyrosine-protein kinase Src
Type:Protein
Mol. Mass.:59838.60
Organism:Homo sapiens (Human)
Description:P12931
Residue:536
BDBM50358250
NameBDBM50358250
Synonyms:CALICOFEROL B
TypeSmall organic molecule
Emp. Form.C27H44O3
Mol. Mass.416.6365
SMILESCC(C)CCC[C@@H](C)[C@H]1[C@@H](O)C[C@H]2[C@H](CCc3cc(O)ccc3C)[C@H](O)CC[C@]12C