Reaction Details
TargetVascular endothelial growth factor receptor 2
LigandBDBM50358247
Substrate/Competitorn/a
Meas. Tech.ChEMBL_790781 (CHEMBL1926234)
IC50 4350±n/a nM
Citation Lai, DYu, Svan Ofwegen, LTotzke, FProksch, PLin, W 9,10-secosteroids, protein kinase inhibitors from the Chinese gorgonian Astrogorgia sp. Bioorg Med Chem19:6873-80 (2011) 
 
Vascular endothelial growth factor receptor 2
Name:Vascular endothelial growth factor receptor 2
Type:Receptor Tyrosine Kinase
Mol. Mass.:151510.97
Organism:Homo sapiens (Human)
Description:P35968
Residue:1356
BDBM50358247
NameBDBM50358247
Synonyms:ASTROGORGIADIOL
TypeSmall organic molecule
Emp. Form.C27H44O2
Mol. Mass.400.6371
SMILESCC(C)CCC[C@@H](C)[C@H]1CC[C@H]2[C@H](CCc3cc(O)ccc3C)[C@H](O)CC[C@]12C