Reaction Details
TargetAcetylcholinesterase
LigandBDBM50358312
Substrate/Competitorn/a
Meas. Tech.ChEMBL_791001 (CHEMBL1925662)
IC50 43600±n/a nM
Citation Sokolova, NVNenajdenko, VGSokolov, VBSerebryakova, OGMakhaeva, GF Synthesis and testing of trifluoromethyl-containing phosphonate-peptide conjugates as inhibitors of serine hydrolases. Bioorg Med Chem Lett21:7216-8 (2011) 
 
Acetylcholinesterase
Name:Acetylcholinesterase
Type:Enzyme
Mol. Mass.:67792.70
Organism:Homo sapiens (Human)
Description:P22303
Residue:614
BDBM50358312
NameBDBM50358312
Synonyms:CHEMBL1922541
TypeSmall organic molecule
Emp. Form.C8H10F3O5P
Mol. Mass.274.131
SMILESCOC(=O)C(OP(C)(=O)OCC#C)C(F)(F)F