Reaction Details
TargetCholinesterase
LigandBDBM50358316
Substrate/Competitorn/a
Meas. Tech.ChEMBL_791003 (CHEMBL1925664)
IC50 746000±n/a nM
Citation Sokolova, NVNenajdenko, VGSokolov, VBSerebryakova, OGMakhaeva, GF Synthesis and testing of trifluoromethyl-containing phosphonate-peptide conjugates as inhibitors of serine hydrolases. Bioorg Med Chem Lett21:7216-8 (2011) 
 
Cholinesterase
Name:Cholinesterase
Type:Enzyme
Mol. Mass.:65643.35
Organism:Equus caballus (Horse)
Description:P81908
Residue:574
BDBM50358316
NameBDBM50358316
Synonyms:CHEMBL1922545
TypeSmall organic molecule
Emp. Form.C22H25F9N5O5P
Mol. Mass.641.4238
SMILESCC(C)(N(Cc1ccccc1)C(=O)C(F)(F)F)C(=O)NCCn1cc(COP(C)(=O)OC(C(F)(F)F)C(F)(F)F)nn1