Reaction Details
TargetCholinesterase
LigandBDBM50358319
Substrate/Competitorn/a
Meas. Tech.ChEMBL_791003 (CHEMBL1925664)
IC50 2000000±n/a nM
Citation Sokolova, NVNenajdenko, VGSokolov, VBSerebryakova, OGMakhaeva, GF Synthesis and testing of trifluoromethyl-containing phosphonate-peptide conjugates as inhibitors of serine hydrolases. Bioorg Med Chem Lett21:7216-8 (2011) 
 
Cholinesterase
Name:Cholinesterase
Type:Enzyme
Mol. Mass.:65643.35
Organism:Equus caballus (Horse)
Description:P81908
Residue:574
BDBM50358319
NameBDBM50358319
Synonyms:CHEMBL1922548
TypeSmall organic molecule
Emp. Form.C24H30F6N5O7P
Mol. Mass.645.4885
SMILESCOC(=O)C(OP(C)(=O)OCc1cn(C[C@@H](NC(=O)CN(Cc2ccccc2)C(=O)C(F)(F)F)C(C)C)nn1)C(F)(F)F