Reaction Details
TargetLiver carboxylesterase
LigandBDBM50358313
Substrate/Competitorn/a
Meas. Tech.ChEMBL_791004 (CHEMBL1925665)
IC50 825000±n/a nM
Citation Sokolova, NVNenajdenko, VGSokolov, VBSerebryakova, OGMakhaeva, GF Synthesis and testing of trifluoromethyl-containing phosphonate-peptide conjugates as inhibitors of serine hydrolases. Bioorg Med Chem Lett21:7216-8 (2011) 
 
Liver carboxylesterase
Name:Liver carboxylesterase
Type:PROTEIN
Mol. Mass.:62009.98
Organism:Sus scrofa
Description:ChEMBL_427761
Residue:566
BDBM50358313
NameBDBM50358313
Synonyms:CHEMBL1922542
TypeSmall organic molecule
Emp. Form.C34H51F6N6O9P
Mol. Mass.832.7677
SMILESCC[C@H](C)[C@H](NC(=O)OC(C)(C)C)C(=O)N(Cc1ccc(OC)cc1OC)C(C)(C)C(=O)N[C@@H](C)Cn1cc(COP(C)(=O)OC(C(F)(F)F)C(F)(F)F)nn1