Reaction Details
TargetLiver carboxylesterase
LigandBDBM50358317
Substrate/Competitorn/a
Meas. Tech.ChEMBL_791004 (CHEMBL1925665)
IC50 182000±n/a nM
Citation Sokolova, NVNenajdenko, VGSokolov, VBSerebryakova, OGMakhaeva, GF Synthesis and testing of trifluoromethyl-containing phosphonate-peptide conjugates as inhibitors of serine hydrolases. Bioorg Med Chem Lett21:7216-8 (2011) 
 
Liver carboxylesterase
Name:Liver carboxylesterase
Type:PROTEIN
Mol. Mass.:62009.98
Organism:Sus scrofa
Description:ChEMBL_427761
Residue:566
BDBM50358317
NameBDBM50358317
Synonyms:CHEMBL1922546
TypeSmall organic molecule
Emp. Form.C21H23F9N5O5P
Mol. Mass.627.3972
SMILESC[C@@H](Cn1cc(COP(C)(=O)OC(C(F)(F)F)C(F)(F)F)nn1)NC(=O)CN(Cc1ccccc1)C(=O)C(F)(F)F