Reaction Details
TargetRho-associated protein kinase 2
LigandBDBM50358478
Substrate/Competitorn/a
Meas. Tech.ChEMBL_789920 (CHEMBL1925273)
IC50 220±n/a nM
Citation Chowdhury, SSessions, EHPocas, JRGrant, WSchröter, TLin, LRuiz, CCameron, MDSchürer, SLoGrasso, PBannister, TDFeng, Y Discovery and optimization of indoles and 7-azaindoles as Rho kinase (ROCK) inhibitors (part-I). Bioorg Med Chem Lett21:7107-12 (2011) 
 
Rho-associated protein kinase 2
Name:Rho-associated protein kinase 2
Type:Protein
Mol. Mass.:160885.43
Organism:Homo sapiens (Human)
Description:O75116
Residue:1388
BDBM50358478
NameBDBM50358478
Synonyms:CHEMBL1923166
TypeSmall organic molecule
Emp. Form.C21H18N4O2
Mol. Mass.358.3932
SMILESCOc1cccc(CNC(=O)c2cc3ccc(nc3[nH]2)-c2ccncc2)c1