Reaction Details
TargetRho-associated protein kinase 2
LigandBDBM50358472
Substrate/Competitorn/a
Meas. Tech.ChEMBL_789920 (CHEMBL1925273)
IC50 1200±n/a nM
Citation Chowdhury, SSessions, EHPocas, JRGrant, WSchröter, TLin, LRuiz, CCameron, MDSchürer, SLoGrasso, PBannister, TDFeng, Y Discovery and optimization of indoles and 7-azaindoles as Rho kinase (ROCK) inhibitors (part-I). Bioorg Med Chem Lett21:7107-12 (2011) 
 
Rho-associated protein kinase 2
Name:Rho-associated protein kinase 2
Type:Protein
Mol. Mass.:160885.43
Organism:Homo sapiens (Human)
Description:O75116
Residue:1388
BDBM50358472
NameBDBM50358472
Synonyms:CHEMBL1923161
TypeSmall organic molecule
Emp. Form.C22H20N4O2
Mol. Mass.372.4198
SMILESCOc1cccc(CNC(=O)c2cc3ccc(cc3[nH]2)-c2ccnc(N)c2)c1