Reaction Details
TargetRho-associated protein kinase 1
LigandBDBM50358479
Substrate/Competitorn/a
Meas. Tech.ChEMBL_789921 (CHEMBL1925274)
IC50 11±n/a nM
Citation Chowdhury, SSessions, EHPocas, JRGrant, WSchröter, TLin, LRuiz, CCameron, MDSchürer, SLoGrasso, PBannister, TDFeng, Y Discovery and optimization of indoles and 7-azaindoles as Rho kinase (ROCK) inhibitors (part-I). Bioorg Med Chem Lett21:7107-12 (2011) 
 
Rho-associated protein kinase 1
Name:Rho-associated protein kinase 1
Type:Serine/threonine-protein kinase
Mol. Mass.:158156.77
Organism:Homo sapiens (Human)
Description:Q13464
Residue:1354
BDBM50358479
NameBDBM50358479
Synonyms:CHEMBL1923167
TypeSmall organic molecule
Emp. Form.C22H19N3O2
Mol. Mass.357.4052
SMILESCOc1cccc(CNC(=O)c2c[nH]c3cc(ccc23)-c2ccncc2)c1