Reaction Details
TargetRho-associated protein kinase 1
LigandBDBM50358481
Substrate/Competitorn/a
Meas. Tech.ChEMBL_789921 (CHEMBL1925274)
IC50 48±n/a nM
Citation Chowdhury, SSessions, EHPocas, JRGrant, WSchröter, TLin, LRuiz, CCameron, MDSchürer, SLoGrasso, PBannister, TDFeng, Y Discovery and optimization of indoles and 7-azaindoles as Rho kinase (ROCK) inhibitors (part-I). Bioorg Med Chem Lett21:7107-12 (2011) 
 
Rho-associated protein kinase 1
Name:Rho-associated protein kinase 1
Type:Serine/threonine-protein kinase
Mol. Mass.:158156.77
Organism:Homo sapiens (Human)
Description:Q13464
Residue:1354
BDBM50358481
NameBDBM50358481
Synonyms:CHEMBL1923168
TypeSmall organic molecule
Emp. Form.C21H18N4O2
Mol. Mass.358.3932
SMILESCOc1cccc(CNC(=O)c2c[nH]c3nc(ccc23)-c2ccncc2)c1