Reaction Details
TargetRho-associated protein kinase 1
LigandBDBM50358485
Substrate/Competitorn/a
Meas. Tech.ChEMBL_789921 (CHEMBL1925274)
IC50 34±n/a nM
Citation Chowdhury, SSessions, EHPocas, JRGrant, WSchröter, TLin, LRuiz, CCameron, MDSchürer, SLoGrasso, PBannister, TDFeng, Y Discovery and optimization of indoles and 7-azaindoles as Rho kinase (ROCK) inhibitors (part-I). Bioorg Med Chem Lett21:7107-12 (2011) 
 
Rho-associated protein kinase 1
Name:Rho-associated protein kinase 1
Type:Serine/threonine-protein kinase
Mol. Mass.:158156.77
Organism:Homo sapiens (Human)
Description:Q13464
Residue:1354
BDBM50358485
NameBDBM50358485
Synonyms:CHEMBL1923172
TypeSmall organic molecule
Emp. Form.C19H14F2N4O
Mol. Mass.352.3375
SMILESFc1ccc(CNC(=O)c2c[nH]c3cc(ccc23)-c2cn[nH]c2)cc1F