Reaction Details
TargetRho-associated protein kinase 1
LigandBDBM50358495
Substrate/Competitorn/a
Meas. Tech.ChEMBL_789921 (CHEMBL1925274)
IC50 560±n/a nM
Citation Chowdhury, SSessions, EHPocas, JRGrant, WSchröter, TLin, LRuiz, CCameron, MDSchürer, SLoGrasso, PBannister, TDFeng, Y Discovery and optimization of indoles and 7-azaindoles as Rho kinase (ROCK) inhibitors (part-I). Bioorg Med Chem Lett21:7107-12 (2011) 
 
Rho-associated protein kinase 1
Name:Rho-associated protein kinase 1
Type:Serine/threonine-protein kinase
Mol. Mass.:158156.77
Organism:Homo sapiens (Human)
Description:Q13464
Residue:1354
BDBM50358495
NameBDBM50358495
Synonyms:CHEMBL1923182
TypeSmall organic molecule
Emp. Form.C20H19N5O2
Mol. Mass.361.3972
SMILESCOc1cccc(c1)[C@H](C)NC(=O)c1cc2ccc(nc2[nH]1)-c1cn[nH]c1