Reaction Details
TargetHistamine H3 receptor
LigandBDBM50358567
Substrate/Competitorn/a
Meas. Tech.ChEMBL_790543 (CHEMBL1925996)
EC50 0.7±n/a nM
Citation Becknell, NCLyons, JAAimone, LDGruner, JAMathiasen, JRRaddatz, RHudkins, RL Synthesis and evaluation of pyridone-phenoxypropyl-R-2-methylpyrrolidine analogues as histamine H3 receptor antagonists. Bioorg Med Chem Lett21:7076-80 (2011) 
 
Histamine H3 receptor
Name:Histamine H3 receptor
Type:G Protein-Coupled Receptor (GPCR)
Mol. Mass.:48691.47
Organism:Homo sapiens (Human)
Description:Binding assays were using CHO cells stably expressing hH3R receptors.
Residue:445
BDBM50358567
NameBDBM50358567
Synonyms:CHEMBL1923729
TypeSmall organic molecule
Emp. Form.C20H26N2O2
Mol. Mass.326.4326
SMILESC[C@@H]1CCCN1CCCOc1ccc(cc1)-c1ccc(=O)n(C)c1