Reaction Details
TargetRho-associated protein kinase 2
LigandBDBM50358687
Substrate/Competitorn/a
Meas. Tech.ChEMBL_789445 (CHEMBL1924421)
IC50 3±n/a nM
Citation Sessions, EHChowdhury, SYin, YPocas, JRGrant, WSchröter, TLin, LRuiz, CCameron, MDLoGrasso, PBannister, TDFeng, Y Discovery and optimization of indole and 7-azaindoles as Rho kinase (ROCK) inhibitors (part-II). Bioorg Med Chem Lett21:7113-8 (2011) 
 
Rho-associated protein kinase 2
Name:Rho-associated protein kinase 2
Type:Protein
Mol. Mass.:160885.43
Organism:Homo sapiens (Human)
Description:O75116
Residue:1388
BDBM50358687
NameBDBM50358687
Synonyms:CHEMBL1922139
TypeSmall organic molecule
Emp. Form.C25H27N5O3
Mol. Mass.445.5136
SMILESCOc1cccc(CNC(=O)c2[nH]c3cc(ccc3c2CN2CCOCC2)-c2cn[nH]c2)c1