Reaction Details
TargetRho-associated protein kinase 1
LigandBDBM50358708
Substrate/Competitorn/a
Meas. Tech.ChEMBL_789446 (CHEMBL1924422)
IC50 121±n/a nM
Citation Sessions, EHChowdhury, SYin, YPocas, JRGrant, WSchröter, TLin, LRuiz, CCameron, MDLoGrasso, PBannister, TDFeng, Y Discovery and optimization of indole and 7-azaindoles as Rho kinase (ROCK) inhibitors (part-II). Bioorg Med Chem Lett21:7113-8 (2011) 
 
Rho-associated protein kinase 1
Name:Rho-associated protein kinase 1
Type:Serine/threonine-protein kinase
Mol. Mass.:158156.77
Organism:Homo sapiens (Human)
Description:Q13464
Residue:1354
BDBM50358708
NameBDBM50358708
Synonyms:CHEMBL1922044
TypeSmall organic molecule
Emp. Form.C25H28N6O2
Mol. Mass.444.5288
SMILESCOc1cccc(CN(CCN2CCCC2)C(=O)c2cc3ccc(nc3[nH]2)-c2cn[nH]c2)c1